Jump to content

Marcos

Members
  • Posts

    185
  • Joined

Recent Profile Visitors

The recent visitors block is disabled and is not being shown to other users.

Marcos's Achievements

Apprentice

Apprentice (3/14)

  • Dedicated Rare
  • First Post Rare
  • Collaborator Rare
  • Conversation Starter Rare
  • One Month Later Rare

Recent Badges

207

Reputation

  1. Boa tarde galera... estou com esse problema, que ao finalizar a complicão do game me apare esse erro: Alguém poderia dar uma orientação para conseguir arrumar? Desde já agradeço a atenção linking ../game_r41026 /usr/local/bin/ld: /usr/lib/liblzma.a(check.o): in function `lzma_sha256_init': /usr/src/contrib/xz/src/liblzma/check/check.h:143: undefined reference to `_libmd_SHA256_Init' /usr/local/bin/ld: /usr/lib/liblzma.a(check.o): in function `lzma_sha256_update' : /usr/src/contrib/xz/src/liblzma/check/check.h:160: undefined reference to `_libmd_SHA256_Update' /usr/local/bin/ld: /usr/lib/liblzma.a(check.o): in function `lzma_sha256_finish: /usr/src/contrib/xz/src/liblzma/check/check.h:167: undefined reference to `_libm d_SHA256_Final' collect2: error: ld returned 1 exit status gmake[1]: *** [Makefile:217: ../game_r41026] Error 1 gmake: *** [Makefile:111: all] Error 2
  2. Password: tlthings.net Obrgiado @tierrilopes
  3. Já conferi tanto as imagens do mapname quanto o uimpashower.py e nada. Não sei sei se tem haver q uso o makepack ou erá que é possível que tenha sido desativado na source?
  4. Boa noite pessoal... Reparei que ao entrar no jogo ou mover para algum mapa não aparece o nome do mapa... Já conferi nos ficheiros py e está correto em comparação ao outros... Será que está desativado em algum lugar? Agradeço a ajuda por dar uma direção para poder concertar... Obrigado...
  5. aqui está, obrigado pela aençãoitem_attribute.cpp
  6. Boa noite alguém que tenha o sistema em questão poderia me ajudar com um erro que estou tendo com o mesmo... O que acontece é o seguinte, eu adicionei, ele adiciona o 8 bonus certinho, quando eu vou adicionar o 7 bonus o servidor cai gerando o seguinte erro: SYSERR: Feb 21 18:24:44 :: number_ex: number(): first argument is bigger than second argument 0 -> -1, item_attribute.cpp 485 vou deixar link e imagens do sistema em questão: Desde já agradeço quem poder dar uma ajuda... Boa noite a todos
  7. Boas, o game compila até o fim, porém na hora de finalzar aparece o seguinte erro: /usr/local/bin/ld: cannot find -lsql collect2: error: ld returned 1 exit status gmake: *** [Makefile:194: ../game_r41023] Error 1 Alguém poderia me ajudar? estou a procurar na internet mais não encontro nada sobre esse erro.
  8. Marcos

    Mapa PvP

    Link quebrado
×
×
  • Create New...