Jump to content

Problema ao finalizar compilação do game


Marcos

Recommended Posts

Boa tarde galera...

estou com esse problema, que ao finalizar a complicão do game me apare esse erro:

Alguém poderia dar uma orientação para conseguir arrumar? Desde já agradeço a atenção

linking ../game_r41026
/usr/local/bin/ld: /usr/lib/liblzma.a(check.o): in function `lzma_sha256_init':
/usr/src/contrib/xz/src/liblzma/check/check.h:143: undefined reference to `_libmd_SHA256_Init'
/usr/local/bin/ld: /usr/lib/liblzma.a(check.o): in function `lzma_sha256_update' :
/usr/src/contrib/xz/src/liblzma/check/check.h:160: undefined reference to `_libmd_SHA256_Update'
/usr/local/bin/ld: /usr/lib/liblzma.a(check.o): in function `lzma_sha256_finish:
/usr/src/contrib/xz/src/liblzma/check/check.h:167: undefined reference to `_libm d_SHA256_Final'
collect2: error: ld returned 1 exit status
gmake[1]: *** [Makefile:217: ../game_r41026] Error 1
gmake: *** [Makefile:111: all] Error 2
 

Link to comment
Share on other sites

Create an account or sign in to comment

You need to be a member in order to leave a comment

Create an account

Sign up for a new account in our community. It's easy!

Register a new account

Sign in

Already have an account? Sign in here.

Sign In Now
×
×
  • Create New...