Jump to content

Erro ao finalizar a compilação do game


Recommended Posts

Boas, o game compila até o fim, porém na hora de finalzar aparece o seguinte erro:

/usr/local/bin/ld: cannot find -lsql

collect2: error: ld returned 1 exit status

gmake: *** [Makefile:194: ../game_r41023] Error 1

 

Alguém poderia me ajudar? estou a procurar na internet mais não encontro nada sobre esse erro.

Link to post
Share on other sites
Em 05/06/2021 em 06:05, Marcos disse:

Boas, o game compila até o fim, porém na hora de finalzar aparece o seguinte erro:

/usr/local/bin/ld: cannot find -lsql

collect2: error: ld returned 1 exit status

gmake: *** [Makefile:194: ../game_r41023] Error 1

 

Alguém poderia me ajudar? estou a procurar na internet mais não encontro nada sobre esse erro.

em src dar gmake all 

Link to post
Share on other sites
1 hora atrás, xabugas123 disse:

em src dar gmake all 

acontece esse erro

Hidden Content

    Give reaction or reply to this topic to see the hidden content.

 

Pkgs instalados:

Hidden Content

    Give reaction or reply to this topic to see the hidden content.

Link to post
Share on other sites
Posted (edited)
1 hora atrás, Marcos disse:

acontece esse erro

Hidden Content

    Give reaction or reply to this topic to see the hidden content.

 

Pkgs instalados:

Hidden Content

    Give reaction or reply to this topic to see the hidden content.

na pasta server onde tem game db common etc... faz gmake all sorry erro meu

Edited by xabugas123
Link to post
Share on other sites
Em 07/06/2021 em 14:52, xabugas123 disse:

na pasta server onde tem game db common etc... faz gmake all sorry erro meu

Resolvido, obrigado xabugas :)

Link to post
Share on other sites

Create an account or sign in to comment

You need to be a member in order to leave a comment

Create an account

Sign up for a new account in our community. It's easy!

Register a new account

Sign in

Already have an account? Sign in here.

Sign In Now
×
×
  • Create New...